{"text_format":"1","workbook":"xlsx","n_sheets":11,"sheets":["Overview Sheet","Cover","Cockpit","Fact Sheet",">>>","Database","Legend","Exchange Rates ","Dropdown","Structural and Cohesion Fund","Cockpit dropdown"],"not_rendered":{"charts":0,"images":7,"macros":1,"external_links":0,"defined_names":39,"comments":0,"pivot_tables":0},"unopened":[],"bounds":{"document_bytes":16777216,"sheet_cells":100000,"rows_first":2000,"rows_last":500,"rows_between":2000,"halvings":0,"cell_chars":16384,"cell_head_chars":4096},"cells_cut":0,"cells_raw":0,"read":"whole","date_system":"1900"}

{"sheet":"Overview Sheet","index":0,"n_rows":17,"n_cols":4,"rows_kept":17,"cut":false,"hidden":true,"merged":[]}
[]
[null,"Funding Instruments"]
[null,"Development of Business Cases for FCH Applications for Regions and Cities"]
[]
[]
[]
[null,"Total Number of Funding Instruments",null,{"$f":"COUNT(Database!B9:B63)","v":55}]
[]
[null,"Number of European Funding Instruments",null,{"$f":"COUNTIF(Database!F9:$F$44,\"EU\")","v":12}]
[]
{"$rows_left_out":8}
{"sheet":"Cover","index":1,"n_rows":42,"n_cols":3,"rows_kept":42,"cut":false,"hidden":true,"merged":[[19,1,21,1],[10,1,18,1],[22,1,26,1],[27,1,37,1],[38,1,40,1]]}
[]
[]
[null,null,{"$f":"TODAY()","v":"2018-02-08"}]
[]
[]
[]
[null,"Overview of funding/financing sources for FCH applications"]
[]
[]
[]
{"$rows_left_out":33}
{"sheet":"Cockpit","index":2,"n_rows":53,"n_cols":19,"rows_kept":53,"cut":false,"hidden":false,"merged":[[42,3,42,10],[36,1,38,12],[10,4,10,5],[22,3,22,10],[24,3,24,10],[26,3,26,10],[28,3,28,10]]}
[]
[null,"Funding and Financing Navigation Tool"]
[null,"Cockpit"]
[]
[null,"Your Filter",null,null,null,null,null,null,null,null,null,null,null,null,null,null,"Your Results"]
[]
[null,"Country*",null,"Project beneficiary",null,null,null,null,null,null,null,null,"FCH application/sector",null,null,null,"Name","Total programme size","Row no"]
[]
[null,"Austria",null,null,null,"Commercial business",null,null,null,null,null,null,null,null,null,null,"European Regional and Development Fund (ERDF); European Social Fund (ESF); European Agricultural Fund for Rural Development (EAFRD), European Maritime and Fisheries Fund (EMFF) - Total",562604.399752,46]
[]
{"$rows_left_out":44}
{"sheet":"Fact Sheet","index":3,"n_rows":41,"n_cols":12,"rows_kept":41,"cut":false,"hidden":false,"merged":[[21,6,23,9],[17,11,27,14],[40,1,40,4],[9,1,9,4],[19,1,19,4],[38,1,38,4],[9,11,13,14],[9,6,9,9],[27,6,27,9],[23,1,34,4],[13,6,13,9],[31,6,33,9],[38,6,38,9],[31,11,33,14],[13,1,15,4],[17,6,17,9]]}
[9]
[null,"Funding programme"]
[null,"Fact Sheet"]
[]
[]
[]
[]
[null,"Name of funding programme",null,null,null,null,"Funding instrument offered",null,null,null,null,"Target applications"]
[]
[null,{"$f":"IF(OR(INDIRECT(\"Database!D\" & RowNo)=\"\",INDIRECT(\"Database!D\" & RowNo)=\"n.i.\"),\"-\",INDIRECT(\"Database!D\" & RowNo))","v":"Connecting Europe Facility - Transport"},null,null,null,null,{"$f":"IF(OR(INDIRECT(\"Database!X\" & RowNo)=\"\",INDIRECT(\"Database!X\" & RowNo)=\"n.i.\"),\"-\",INDIRECT(\"Database!X\" & RowNo))","v":"Grant "},null,null,null,null,{"$f":"IF(OR(INDIRECT(\"Database!Q\" & RowNo)=\"\",INDIRECT(\"Database!Q\" & RowNo)=\"n.i.\"),IF(OR(INDIRECT(\"Database!R\" & RowNo)=\"\",INDIRECT(\"Database!R\" & RowNo)=\"n.i.\"),\"-\",INDIRECT(\"Database!R\" & RowNo)),INDIRECT(\"Database!Q\" & RowNo))","v":"Only Projects of Common Interest (PCIs) and projects within the horizontal priorities eligible. Horizontal priorities include according to points (a) to (d) of Article 33 of Regulation (EU) No 1315/2013: \n\n- support and promote the decarbonisation of transport through transition to innovative and sustainable transport technologies\n\n- make possible the decarbonisation of all transport modes by stimulating energy efficiency, introduce alternative propulsion systems, including electricity supply systems, and provide corresponding infrastructure. Such infrastructure may include grids and other facilities necessary for the energy supply, may take account of the infrastructure-vehicle interface and may encompass telematic applications\n\n- improve the safety and sustainability of the movement of persons and of the transport of goods\n\n- improve the operation, management, accessibility, interoperability, multimodality and efficiency of the network, including through multimodal ticketing and coordination of travel timetables"}]
{"$rows_left_out":32}
{"sheet":">>>","index":4,"n_rows":0,"n_cols":0,"rows_kept":0,"cut":false,"hidden":true,"merged":[]}

{"sheet":"Database","index":5,"n_rows":115,"n_cols":40,"rows_kept":115,"cut":false,"hidden":true,"merged":[[5,39,7,39],[5,12,5,14],[5,2,5,11],[5,23,5,33],[5,34,5,37],[5,15,5,22]]}
[]
[null,"FCH2 JU | Business Cases for Regions and Cities"]
[null,{"$f":"Cover!B7","v":"Overview of funding/financing sources for FCH applications"}]
[]
[null,null,null,null," ",null,null,null,null,null,null,null,null,null,null,null,null,null,null,null,null,null,null,null,null,null,null,null,null,null,null,null," "]
[null,"#","Programme-related information",null,null,null,null,null,null,null,null,null,"General information and context of programme",null,null,"Programme eligibility",null,null,null,null,null,null,null,"Funding details and application procedure",null,null,null,null,null,null,null,null,null,null,"Experiences with programme",null,null,null,"Further comments","Search exclusion"]
[null,null,"Final entity providing funding","Name of entity-specific financing programme","Focus area of programme","Focus area of programme country","Focus area of programme region","Total entity-based programme financing volume  [in FC m]","Local Currency Code","Total entity-based programme financing volume  [in EUR m]","Time frame of budget","Brief description of entity-based programme","Name of major overarching programme/institution (selection)","Start year of major overarching programme","End year of major overarching programme","Policy related project requirements / required project objectives","Eligible applications, technologies, assets, systems and products ","Working Groups filter","Target beneficiaries/recipients of funding","Beneficiary filter","Beneficiary-related prerequisites","Eligibility and pre-financing criteria","Co-funding required","Financial instrument offered through programme","Min. level of funding per project \n[in FC m]","Local Currency Code ","Min. level of funding per project [in EUR m]","Max. level of funding per project\n[in FC m]","Local Currency Code","Max. level of funding per project [in EUR m]","Application process","Approval entity ","Application time","Where to apply","FCH example projects","Region/Cities with experience using this instrument","Website","First level of contact","Comments"]
[null,null,null,null,null,null,null,null,null,null,null,null,null,null,null,"e.g. regional inclusion, coalitions etc.",null,null,null,null,"e.g. size of company employees, revenues), financial health, etc.",null,null,null,null,null,null,null,null,null,null,null,"How long does the application take?"]
[null,1,"Innovation and Networks Executive Agency (INEA) ","Connecting Europe Facility - Transport","EU","EU",{"$f":"IF(E9=\"National \",F9,IF(E9=\"Global\",\"Global\",IF(E9=\"EU\",\"EU\",\"\")))","v":"EU"},24050,{"$f":"VLOOKUP($F9,'Exchange Rates '!$B$7:$D$37,2,FALSE)","v":"EUR"},{"$f":"IFERROR(H9*(VLOOKUP($F9,'Exchange Rates '!$B$7:$D$37,3,FALSE)),H9)","v":24050},"total","CEF-Transport is a funding instrument to realize the European transport infrastructure policy. It aims at supporting investments in building new transport infrastructure in Europe or rehabilitating and upgrading existing infrastructure.","Innovation and Networks Executive Agency (INEA) \n\n/ European Investment Bank (EIB)",2014,2020,"- Focuses on cross-border projects and projects aiming at removing bottlenecks\n- Projects should reduce the environmental impact of transport, enhance energy efficiency and increase safety \n- Projects must be identified as Projects of Common Interest (PCI)","Only Projects of Common Interest (PCIs) and projects within the horizontal priorities eligible. Horizontal priorities include according to points (a) to (d) of Article 33 of Regulation (EU) No 1315/2013: \n\n- support and promote the decarbonisation of transport through transition to innovative and sustainable transport technologies\n\n- make possible the decarbonisation of all transport modes by stimulating energy efficiency, introduce alternative propulsion systems, including electricity supply systems, and provide corresponding infrastructure. Such infrastructure may include grids and other facilities necessary for the energy supply, may take account of the infrastructure-vehicle interface and may encompass telematic applications\n\n- improve the safety and sustainability of the movement of persons and of the transport of goods\n\n- improve the operation, management, accessibility, interoperability, multimodality and efficiency of the network, including through multimodal ticketing and coordination of travel timetables","Heavy duty transport applications; Light- and medium duty transport applications; Maritime and aviation transport applications; Other","- Public sector\n- Non-profit sector \n- Academic/research sector\n- Commercial business\n- SME","Public entity; Commercial business; SME; Academic institution; NGO",null,"- Grants for studies, 50% of the eligible costs.\n- Grants for works: between 20% and 40% of the eligible costs (depending on exact application)\n\nADDITIONAL OPPORTUNITY: CEF Transport Blending Call - (Open until April 2018):\n- Grant agreement dependent on debt financing closure as a result (within 12 months of grant assignment)\n- 20% of eligible costs can covered under the grant part\n- Grant can only cover delta between benchmark technology and new technology for individual applications","Yes","Grant ",null,{"$f":"VLOOKUP($F9,'Exchange Rates '!$B$7:$D$37,2,FALSE)","v":"EUR"},null,"Grants subject to a max. % of eligible costs; % differs according to type of application and national preconditions",{"$f":"VLOOKUP($F9,'Exchange Rates '!$B$7:$D$37,2,FALSE)","v":"EUR"},"grants subject to a max. % of eligible costs; % differs according to type of application and national preconditions","Call for proposals","INEA carries out the evaluation of the eligible proposals, supported by independent experts",null,"https://ec.europa.eu/inea/en/connecting-europe-facility/cef-transport/apply-funding","https://ec.europa.eu/inea/en/connecting-europe-facility/cef-transport/projects-by-country/multi-country/2015-eu-tm-0316-s",null,"https://ec.europa.eu/inea/connecting-europe-facility/cef-transport","inea@ec.europa.eu","EUR 11.3 bn is reserved for projects in the member states eligible for the Cohesion Fund.\nBudget is allocated through a competitive procedure. Calls for proposals are issued according to the defined work programmes. There are annual calls and multi-annual calls (MAP calls). The MAP calls refer to projects or horizontal priorities listed in Part I of Annex I to the CEF Regulation \n\n* The availability of EU wide funding programmes in countires belonging to the European Economic Area (EEA) needs to be investigated on a project basis. "]
[null,2,"Innovation and Networks Executive Agency (INEA) ","Connecting Europe Facility - Energy","EU","EU","EU",5350,{"$f":"VLOOKUP($F10,'Exchange Rates '!$B$7:$D$37,2,FALSE)","v":"EUR"},{"$f":"IFERROR(H10*(VLOOKUP($F10,'Exchange Rates '!$B$7:$D$37,3,FALSE)),H10)","v":5350},"total","CEF is engineered to address the investment gap in the energy sector via grants contributing to the construction costs. They will be applied to fill in the gaps in commercial viability of the projects that are particularly relevant for Europe.","Innovation and Networks Executive Agency (INEA) \n\n/ European Investment Bank (EIB)",2014,2020,"- Aims at projects better interconnecting energy networks towards a single European energy market\n- Projects must be identified as projects of Common Interest (PCI)\n","- Only Projects of Common Interest (PCIs) and projects within the priority areas eligible:\n\n- Smart grids deployment: adoption of smart grid technologies across the Union to efficiently integrate the behaviour and actions of all users  connected to the electricity network, in particular the generation of large amounts of electricity from renewable or distributed energy sources and demand response by consumers\n- Electricity highways: first electricity highways by 2020, with a view to building an electricity highways system across the Union that is capable of:\n-- accommodating ever-increasing wind surplus generation in and around the Northern and Baltic Seas\n-- increasing renewable generation in the East and South of Europe and also North Africa;\n- connecting these new generation hubs with major storage capacities in the Nordic countries, the Alps and other regions with major consumption centres, and\n- coping with an increasingly variable and decentralised electricity supply and flexible electricity demand ","Stationary applications; Energy-to-hydrogen applications; Other","- Public sector\n- Non-profit sector \n- Academic/research sector\n- Commercial business\n- SME","Public entity; Commercial business; SME; Academic institution; NGO",null,"- 50% of the eligible cost of studies and/or works. \nMay be increased to 75% for actions with a high degree of regional or Union-wide security of supply, strengthen the solidarity of the Union or comprise highly innovative solutions","Yes","Grant ",null,{"$f":"VLOOKUP($F10,'Exchange Rates '!$B$7:$D$37,2,FALSE)","v":"EUR"},null,"Grants subject to a max. % of eligible costs; % differs according to type of application and national preconditions",{"$f":"VLOOKUP($F10,'Exchange Rates '!$B$7:$D$37,2,FALSE)","v":"EUR"},"Grants subject to a max. % of eligible costs; % differs according to type of application and national preconditions","Call for proposals","INEA carries out the evaluation of the eligible proposals, supported by independent experts",null,"https://ec.europa.eu/inea/en/connecting-europe-facility/cef-energy/how-apply",null,null,"https://ec.europa.eu/inea/en/connecting-europe-facility/cef-energy","inea@ec.europa.eu","Budget is allocated through a competitive procedure. Calls for proposals are issued according to the defined work programmes. There are annual calls and multi-annual calls (MAP calls). The MAP calls refer to projects or horizontal priorities listed in Part I of Annex I to the CEF Regulation \n\n* The availability of EU wide funding programmes in countires belonging to the European Economic Area (EEA) needs to be investigated on a project basis. "]
{"$rows_left_out":106}
{"sheet":"Legend","index":6,"n_rows":16,"n_cols":20,"rows_kept":16,"cut":false,"hidden":true,"merged":[]}
[]
[]
[null,"List of abbreviations"]
[]
[]
[null,"Description","Abbreviation"]
[null,"Council of Europe Development Bank","CEB"]
[null,"European Commission","EC"]
[null,"European Investment Bank","Banco Santander Spain"]
[null,"Foreign Currency ","FC"]
{"$rows_left_out":7}
{"sheet":"Exchange Rates ","index":7,"n_rows":37,"n_cols":4,"rows_kept":37,"cut":false,"hidden":true,"merged":[[2,1,2,3]]}
[]
[]
[null,"Exchange rates and currency codes"]
[]
[]
[null,"Country","Abbreviation Currency","FC/EUR"]
[null,"Austria","EUR","1"]
[null,"Belgium","EUR","1"]
[null,"Bulgaria","BGN",0.50951000000000002]
[null,"Croatia","HRK",0.13472999999999999]
{"$rows_left_out":28}
{"sheet":"Dropdown","index":8,"n_rows":37,"n_cols":28,"rows_kept":37,"cut":false,"hidden":true,"merged":[]}
[]
[null,"Name of providing institution","Name of programme","Aim of programme","Type of financing offered","Geographic focus","Name of country, geographic region","Eligible Applications","FCH projects previously funded? ","Target group","Total budget availability","Time frame of availability ","Funding amount","Financial instrument offered through programme","Max. level of funding per project","Eligibility criteria","Pre-financing requirements","Application process","Number of application stages","Application lead time","Approval entity ","Where to apply","Overlaps with other instruments","Potential to act as game changers","Show-stopper criteria ","City/region with experience with this instrument (project name and contact person)","Website","Co-funding required"]
[null,null,null,null,"Debt","Global","Austria",null,"Yes","SMEs",null,null,null,"Loan",null,null,null,null,null,null,null,null,null,null,null,null,null,"Yes"]
[null,null,null,null,"Equity","EU","Belgium",null,"No","Public Sector",null,null,null,"Grant ",null,null,null,null,null,null,null,null,null,null,null,null,null,"No"]
[null,null,null,null,"Grant","National","Bulgaria",null,null,"Private Sector",null,null,null,"Equity"]
[null,null,null,null,"Various","Regional","Croatia",null,null,"Municipalities",null,null,null,"Mezzanine"]
[null,null,null,null,"Other",null,"Cyprus",null,null,"Comercial Sector"]
[null,null,null,null,null,null,"Czech Republic",null,null,"Non-profit Sector"]
[null,null,null,null,null,null,"Denmark",null,null,"Academic/Research Sector"]
[null,null,null,null,null,null,"Estonia",null,null,"Other"]
{"$rows_left_out":28}
{"sheet":"Structural and Cohesion Fund","index":9,"n_rows":286,"n_cols":8,"rows_kept":286,"cut":false,"hidden":true,"merged":[]}
[]
[null,"FCH2 JU | Business Cases for Regions and Cities"]
[null,"Structural and Cohesion Fund Eligibility"]
[]
[null,null,null,null,null," "]
[null,"Eligibility","Abbreviation"]
[null,"Cohesion Fund","C"]
[null,"Structural Fund - Less developed region","S1"]
[null,"Structural Fund - Transition region","S2"]
[null,"Structural Fund - More developed region","S3"]
{"$rows_left_out":277}
{"sheet":"Cockpit dropdown","index":10,"n_rows":301,"n_cols":7,"rows_kept":301,"cut":false,"hidden":true,"merged":[]}
[null,"Country",null,"Country","Region",null,"FCH application/sector"]
[null,"Austria",null,"Austria","Other",null,"Heavy duty transport"]
[null,"Belgium",null,"Austria","Burgenland (AT)",null,"Light- and medium duty transport"]
[null,"Bulgaria",null,"Austria","Kärnten",null,"Maritime and aviation transport"]
[null,"Croatia",null,"Austria","Niederösterreich",null,"Stationary"]
[null,"Cyprus",null,"Austria","Oberösterreich",null,"Energy-to-hydrogen"]
[null,"Czech Republic",null,"Austria","Salzburg",null,"Other"]
[null,"Denmark",null,"Austria","Steiermark"]
[null,"Estonia",null,"Austria","Tirol"]
[null,"Finland",null,"Austria","Vorarlberg"]
{"$rows_left_out":291}